{"text_format":"1","workbook":"xlsx","n_sheets":16,"sheets":["START","Styczeń","Luty","Marzec","Kwiecień","Maj","Czerwiec","Lipiec","Sierpień","Wrzesień","Październik","Podsumowanie","Składki","Pełna Lista","Odpis_procentowy","Rozliczenie"],"not_rendered":{"charts":0,"images":1,"macros":1,"external_links":0,"defined_names":1,"comments":0,"pivot_tables":0},"unopened":[],"bounds":{"document_bytes":16777216,"sheet_cells":100000,"rows_first":2000,"rows_last":500,"rows_between":2000,"halvings":0,"cell_chars":16384,"cell_head_chars":4096},"cells_cut":0,"cells_raw":0,"read":"whole","date_system":"1900"}

{"sheet":"START","index":0,"n_rows":7,"n_cols":3,"rows_kept":7,"cut":false,"hidden":false,"merged":[[0,2,1,10],[6,0,26,0],[3,2,4,10],[6,1,26,10]]}
[null,null,"Okręg Mazowiecki"]
[]
[]
[null,null,"Polskiego Związku Wędkarskiego w Warszawie"]
[]
[]
["PANEL NAWIGACYJNY"]

{"sheet":"Styczeń","index":1,"n_rows":8,"n_cols":32,"rows_kept":8,"cut":false,"hidden":false,"merged":[[2,0,2,1],[0,0,0,30],[3,0,5,0],[3,1,5,1],[3,2,5,2],[3,3,5,3],[3,5,5,5],[3,6,5,6],[3,7,3,13],[3,14,3,18],[3,19,3,21],[3,25,3,27],[3,28,3,29],[3,30,5,30],[4,21,5,21],[4,29,5,29],[3,4,5,4],[2,3,2,4],[3,22,3,24],[4,24,5,24]]}
["LISTA PRZYJĘTYCH SKŁADEK W STYCZNIU 2024 R."]
[]
[{"$f":"IF((IFERROR((MATCH(\"Błąd\",LISTA_1[[#All],[AF]],0)+6),0))<8,\"Wyliczenia poprawne\",\"Wykryto błąd wiersz nr\")","v":"Wyliczenia poprawne"},null,{"$f":"IFERROR((MATCH(\"Błąd\",LISTA_1[[#All],[AF]],0)+6),0)","v":0},"Podsumowanie miesiąca",null,{"$f":"COUNTA(LISTA_1[F])","v":0},{"$f":"SUM(LISTA_1[G])","v":0},{"$f":"SUM(LISTA_1[H])","v":0},{"$f":"SUM(LISTA_1[I])","v":0},{"$f":"SUM(LISTA_1[J])","v":0},{"$f":"SUM(LISTA_1[K])","v":0},{"$f":"SUM(LISTA_1[L])","v":0},{"$f":"SUM(LISTA_1[M])","v":0},{"$f":"SUM(LISTA_1[N])","v":0},{"$f":"SUM(LISTA_1[O])","v":0},{"$f":"SUM(LISTA_1[P])","v":0},{"$f":"SUM(LISTA_1[Q])","v":0},{"$f":"SUM(LISTA_1[R])","v":0},{"$f":"SUM(LISTA_1[S])","v":0},{"$f":"SUM(LISTA_1[T])","v":0},{"$f":"SUM(LISTA_1[U])","v":0},{"$f":"SUM(LISTA_1[V])","v":0},{"$f":"SUM(LISTA_1[W])","v":0},{"$f":"SUM(LISTA_1[X])","v":0},{"$f":"SUM(LISTA_1[Y])","v":0},{"$f":"SUM(LISTA_1[Z])","v":0},{"$f":"SUM(LISTA_1[AA])","v":0},{"$f":"SUM(LISTA_1[AB])","v":0},{"$f":"SUM(LISTA_1[AC])","v":0},{"$f":"SUM(LISTA_1[AD])","v":0},{"$f":"SUM(LISTA_1[AE])","v":0}]
["Lp.","Dnia","NUMER \nKARTY WĘDKARSKIEJ","NAZWISKO","IMIĘ","NUMER ZEZWOLENIA","HOLOGRAM ZEZW.","SKŁADKI CZŁONKOWSKIE",null,null,null,null,null,null,"SKŁADKI OKRĘGOWE",null,null,null,null,"WODY GÓRSKIE",null,null,"TROLLING",null,null,"WPISOWE",null,null,"LEGITYMACJE",null,"RAZEM"]
[null,null,null,null,null,null,null,170,128,85,85,43,43,43,240,180,156,120,55,60,30,"HOLOGRAM",1700,1400,"HOLOGRAM TROLLING",30,1,1,10,"BEZPŁATNA"]
[null,null,null,null,null,null,null,"Podstawowa","Srebrna odznaka PZW                                            ","Złota odznaka PZW                                         ","Niepełnosprawność znaczna","Młodzież \n(17-24 lata)                                 ","Wieńce               ","Uczestnik \n(do 16 lat)","Podstawowa","ULGA I \n srebrna odznaka","ULGA II\n wiek k.-60 m.-65\nniep. umiarkowana ","ULGA III  \nzłota, niep. znaczna","ULGA IV wieńce, młodzi.uczestnik","Podstawowa\nULGA I, ULGA II","ULGA III, ULGA IV",null,"PEŁNA \nwody nizinne, górskie i trolling","UZUPEŁNIAJĄCA\nwody nizinne",null,"CZŁONEK ZWYCZAJNY","CZŁONEK UCZESTNIK","UCZESTNIK NOWO WSTĘPUJĄCY","PŁATNA"]
["A","B","C","D","E","F","G","H","I","J","K","L","M","N","O","P","Q","R","S","T","U","V","W","X","Y","Z","AA","AB","AC","AD","AE","AF"]
[null,null,null,null,null,null,null,null,null,null,null,null,null,null,null,null,null,null,null,null,null,null,null,null,null,null,null,null,null,null,null,{"$f":"IFERROR((IF(LISTA_1[AE]=(LISTA_1[[#This Row],[H]]*$H$5)+(LISTA_1[[#This Row],[I]]*$I$5)+(LISTA_1[[#This Row],[J]]*$J$5)+(LISTA_1[[#This Row],[K]]*$K$5)+(LISTA_1[[#This Row],[L]]*$L$5)+(LISTA_1[[#This Row],[M]]*$M$5)+(LISTA_1[[#This Row],[N]]*$N$5)+(LISTA_1[[#This Row],[O]]*$O$5)+(LISTA_1[[#This Row],[P]]*$P$5)+(LISTA_1[[#This Row],[Q]]*$Q$5)+(LISTA_1[[#This Row],[R]]*$R$5)+(LISTA_1[[#This Row],[S]]*$S$5)+(LISTA_1[[#This Row],[T]]*$T$5)+(LISTA_1[[#This Row],[U]]*$U$5)+(LISTA_1[[#This Row],[W]]*$W$5)+(LISTA_1[[#This Row],[X]]*$X$5)+(LISTA_1[[#This Row],[AA]]*$AA$5)+(LISTA_1[[#This Row],[Z]]*$Z$5)+(LISTA_1[[#This Row],[AB]]*$AB$5)+(LISTA_1[[#This Row],[AC]]*$AC$5),\"Poprawnie\",\"Błąd\")),\"Błąd\")","v":"Poprawnie"}]

{"sheet":"Luty","index":2,"n_rows":8,"n_cols":32,"rows_kept":8,"cut":false,"hidden":false,"merged":[[4,24,5,24],[3,30,5,30],[4,21,5,21],[4,29,5,29],[2,0,2,1],[3,4,5,4],[2,3,2,4],[0,0,0,30],[3,0,5,0],[3,1,5,1],[3,2,5,2],[3,3,5,3],[3,5,5,5],[3,6,5,6],[3,7,3,13],[3,14,3,18],[3,19,3,21],[3,25,3,27],[3,28,3,29],[3,22,3,24]]}
["LISTA PRZYJĘTYCH SKŁADEK W LUTYM 2024 R."]
[]
[{"$f":"IF((IFERROR((MATCH(\"Błąd\",LISTA_2[[#All],[AF]],0)+6),0))<8,\"Wyliczenia poprawne\",\"Wykryto błąd wiersz nr\")","v":"Wyliczenia poprawne"},null,{"$f":"IFERROR((MATCH(\"Błąd\",LISTA_2[[#All],[AF]],0)+6),0)","v":0},"Podsumowanie miesiąca",null,{"$f":"COUNTA(LISTA_2[F])","v":0},{"$f":"SUM(LISTA_2[G])","v":0},{"$f":"SUM(LISTA_2[H])","v":0},{"$f":"SUM(LISTA_2[I])","v":0},{"$f":"SUM(LISTA_2[J])","v":0},{"$f":"SUM(LISTA_2[K])","v":0},{"$f":"SUM(LISTA_2[L])","v":0},{"$f":"SUM(LISTA_2[M])","v":0},{"$f":"SUM(LISTA_2[N])","v":0},{"$f":"SUM(LISTA_2[O])","v":0},{"$f":"SUM(LISTA_2[P])","v":0},{"$f":"SUM(LISTA_2[Q])","v":0},{"$f":"SUM(LISTA_2[R])","v":0},{"$f":"SUM(LISTA_2[S])","v":0},{"$f":"SUM(LISTA_2[T])","v":0},{"$f":"SUM(LISTA_2[U])","v":0},{"$f":"SUM(LISTA_2[V])","v":0},{"$f":"SUM(LISTA_2[W])","v":0},{"$f":"SUM(LISTA_2[X])","v":0},{"$f":"SUM(LISTA_2[Y])","v":0},{"$f":"SUM(LISTA_2[Z])","v":0},{"$f":"SUM(LISTA_2[AA])","v":0},{"$f":"SUM(LISTA_2[AB])","v":0},{"$f":"SUM(LISTA_2[AC])","v":0},{"$f":"SUM(LISTA_2[AD])","v":0},{"$f":"SUM(LISTA_2[AE])","v":0}]
["Lp.","Dnia","NUMER \nKARTY WĘDKARSKIEJ","NAZWISKO","IMIĘ","NUMER ZEZWOLENIA","HOLOGRAM ZEZW.","SKŁADKI CZŁONKOWSKIE",null,null,null,null,null,null,"SKŁADKI OKRĘGOWE",null,null,null,null,"WODY GÓRSKIE",null,null,"TROLLING",null,null,"WPISOWE",null,null,"LEGITYMACJE",null,"RAZEM"]
[null,null,null,null,null,null,null,170,128,85,85,43,43,43,240,180,156,120,55,60,30,"HOLOGRAM",1700,1400,"HOLOGRAM TROLLING",30,1,1,10,"BEZPŁATNA"]
[null,null,null,null,null,null,null,"Podstawowa","Srebrna odznaka PZW                                            ","Złota odznaka PZW                                         ","Niepełnosprawność znaczna","Młodzież \n(17-24 lata)                                 ","Wieńce               ","Uczestnik \n(do 16 lat)","Podstawowa","ULGA I \n srebrna odznaka","ULGA II\n wiek k.-60 m.-65\nniep. umiarkowana ","ULGA III  \nzłota, niep. znaczna","ULGA IV wieńce, młodzi.uczestnik","Podstawowa\nULGA I, ULGA II","ULGA III, ULGA IV",null,"PEŁNA \nwody nizinne, górskie i trolling","UZUPEŁNIAJĄCA\nwody nizinne",null,"CZŁONEK ZWYCZAJNY","CZŁONEK UCZESTNIK","UCZESTNIK NOWO WSTĘPUJĄCY","PŁATNA"]
["A","B","C","D","E","F","G","H","I","J","K","L","M","N","O","P","Q","R","S","T","U","V","W","X","Y","Z","AA","AB","AC","AD","AE","AF"]
[null,null,null,null,null,null,null,null,null,null,null,null,null,null,null,null,null,null,null,null,null,null,null,null,null,null,null,null,null,null,null,{"$f":"IFERROR((IF(LISTA_2[AE]=(LISTA_2[[#This Row],[H]]*$H$5)+(LISTA_2[[#This Row],[I]]*$I$5)+(LISTA_2[[#This Row],[J]]*$J$5)+(LISTA_2[[#This Row],[K]]*$K$5)+(LISTA_2[[#This Row],[L]]*$L$5)+(LISTA_2[[#This Row],[M]]*$M$5)+(LISTA_2[[#This Row],[N]]*$N$5)+(LISTA_2[[#This Row],[O]]*$O$5)+(LISTA_2[[#This Row],[P]]*$P$5)+(LISTA_2[[#This Row],[Q]]*$Q$5)+(LISTA_2[[#This Row],[R]]*$R$5)+(LISTA_2[[#This Row],[S]]*$S$5)+(LISTA_2[[#This Row],[T]]*$T$5)+(LISTA_2[[#This Row],[U]]*$U$5)+(LISTA_2[[#This Row],[W]]*$W$5)+(LISTA_2[[#This Row],[X]]*$X$5)+(LISTA_2[[#This Row],[AA]]*$AA$5)+(LISTA_2[[#This Row],[Z]]*$Z$5)+(LISTA_2[[#This Row],[AB]]*$AB$5)+(LISTA_2[[#This Row],[AC]]*$AC$5),\"Poprawnie\",\"Błąd\")),\"Błąd\")","v":"Poprawnie"}]

{"sheet":"Marzec","index":3,"n_rows":8,"n_cols":32,"rows_kept":8,"cut":false,"hidden":false,"merged":[[4,24,5,24],[3,30,5,30],[4,21,5,21],[4,29,5,29],[2,0,2,1],[3,4,5,4],[2,3,2,4],[0,0,0,30],[3,0,5,0],[3,1,5,1],[3,2,5,2],[3,3,5,3],[3,5,5,5],[3,6,5,6],[3,7,3,13],[3,14,3,18],[3,19,3,21],[3,25,3,27],[3,28,3,29],[3,22,3,24]]}
["LISTA PRZYJĘTYCH SKŁADEK W MARCU 2024 R."]
[]
[{"$f":"IF((IFERROR((MATCH(\"Błąd\",LISTA_3[[#All],[AF]],0)+6),0))<8,\"Wyliczenia poprawne\",\"Wykryto błąd wiersz nr\")","v":"Wyliczenia poprawne"},null,{"$f":"IFERROR((MATCH(\"Błąd\",LISTA_3[[#All],[AF]],0)+6),0)","v":0},"Podsumowanie miesiąca",null,{"$f":"COUNTA(LISTA_3[F])","v":0},{"$f":"SUM(LISTA_3[G])","v":0},{"$f":"SUM(LISTA_3[H])","v":0},{"$f":"SUM(LISTA_3[I])","v":0},{"$f":"SUM(LISTA_3[J])","v":0},{"$f":"SUM(LISTA_3[K])","v":0},{"$f":"SUM(LISTA_3[L])","v":0},{"$f":"SUM(LISTA_3[M])","v":0},{"$f":"SUM(LISTA_3[N])","v":0},{"$f":"SUM(LISTA_3[O])","v":0},{"$f":"SUM(LISTA_3[P])","v":0},{"$f":"SUM(LISTA_3[Q])","v":0},{"$f":"SUM(LISTA_3[R])","v":0},{"$f":"SUM(LISTA_3[S])","v":0},{"$f":"SUM(LISTA_3[T])","v":0},{"$f":"SUM(LISTA_3[U])","v":0},{"$f":"SUM(LISTA_3[V])","v":0},{"$f":"SUM(LISTA_3[W])","v":0},{"$f":"SUM(LISTA_3[X])","v":0},{"$f":"SUM(LISTA_3[Y])","v":0},{"$f":"SUM(LISTA_3[Z])","v":0},{"$f":"SUM(LISTA_3[AA])","v":0},{"$f":"SUM(LISTA_3[AB])","v":0},{"$f":"SUM(LISTA_3[AC])","v":0},{"$f":"SUM(LISTA_3[AD])","v":0},{"$f":"SUM(LISTA_3[AE])","v":0}]
["Lp.","Dnia","NUMER \nKARTY WĘDKARSKIEJ","NAZWISKO","IMIĘ","NUMER ZEZWOLENIA","HOLOGRAM ZEZW.","SKŁADKI CZŁONKOWSKIE",null,null,null,null,null,null,"SKŁADKI OKRĘGOWE",null,null,null,null,"WODY GÓRSKIE",null,null,"TROLLING",null,null,"WPISOWE",null,null,"LEGITYMACJE",null,"RAZEM"]
[null,null,null,null,null,null,null,170,128,85,85,43,43,43,240,180,156,120,55,60,30,"HOLOGRAM",1700,1400,"HOLOGRAM TROLLING",30,1,1,10,"BEZPŁATNA"]
[null,null,null,null,null,null,null,"Podstawowa","Srebrna odznaka PZW                                            ","Złota odznaka PZW                                         ","Niepełnosprawność znaczna","Młodzież \n(17-24 lata)                                 ","Wieńce               ","Uczestnik \n(do 16 lat)","Podstawowa","ULGA I \n srebrna odznaka","ULGA II\n wiek k.-60 m.-65\nniep. umiarkowana ","ULGA III  \nzłota, niep. znaczna","ULGA IV wieńce, młodzi.uczestnik","Podstawowa\nULGA I, ULGA II","ULGA III, ULGA IV",null,"PEŁNA \nwody nizinne, górskie i trolling","UZUPEŁNIAJĄCA\nwody nizinne",null,"CZŁONEK ZWYCZAJNY","CZŁONEK UCZESTNIK","UCZESTNIK NOWO WSTĘPUJĄCY","PŁATNA"]
["A","B","C","D","E","F","G","H","I","J","K","L","M","N","O","P","Q","R","S","T","U","V","W","X","Y","Z","AA","AB","AC","AD","AE","AF"]
[null,null,null,null,null,null,null,null,null,null,null,null,null,null,null,null,null,null,null,null,null,null,null,null,null,null,null,null,null,null,null,{"$f":"IFERROR((IF(LISTA_3[AE]=(LISTA_3[[#This Row],[H]]*$H$5)+(LISTA_3[[#This Row],[I]]*$I$5)+(LISTA_3[[#This Row],[J]]*$J$5)+(LISTA_3[[#This Row],[K]]*$K$5)+(LISTA_3[[#This Row],[L]]*$L$5)+(LISTA_3[[#This Row],[M]]*$M$5)+(LISTA_3[[#This Row],[N]]*$N$5)+(LISTA_3[[#This Row],[O]]*$O$5)+(LISTA_3[[#This Row],[P]]*$P$5)+(LISTA_3[[#This Row],[Q]]*$Q$5)+(LISTA_3[[#This Row],[R]]*$R$5)+(LISTA_3[[#This Row],[S]]*$S$5)+(LISTA_3[[#This Row],[T]]*$T$5)+(LISTA_3[[#This Row],[U]]*$U$5)+(LISTA_3[[#This Row],[W]]*$W$5)+(LISTA_3[[#This Row],[X]]*$X$5)+(LISTA_3[[#This Row],[AA]]*$AA$5)+(LISTA_3[[#This Row],[Z]]*$Z$5)+(LISTA_3[[#This Row],[AB]]*$AB$5)+(LISTA_3[[#This Row],[AC]]*$AC$5),\"Poprawnie\",\"Błąd\")),\"Błąd\")","v":"Poprawnie"}]

{"sheet":"Kwiecień","index":4,"n_rows":8,"n_cols":32,"rows_kept":8,"cut":false,"hidden":false,"merged":[[4,24,5,24],[3,30,5,30],[4,21,5,21],[4,29,5,29],[2,0,2,1],[3,4,5,4],[2,3,2,4],[0,0,0,30],[3,0,5,0],[3,1,5,1],[3,2,5,2],[3,3,5,3],[3,5,5,5],[3,6,5,6],[3,7,3,13],[3,14,3,18],[3,19,3,21],[3,25,3,27],[3,28,3,29],[3,22,3,24]]}
["LISTA PRZYJĘTYCH SKŁADEK W KWIETNIU 2024 R."]
[]
[{"$f":"IF((IFERROR((MATCH(\"Błąd\",LISTA_4[[#All],[AF]],0)+6),0))<8,\"Wyliczenia poprawne\",\"Wykryto błąd wiersz nr\")","v":"Wyliczenia poprawne"},null,{"$f":"IFERROR((MATCH(\"Błąd\",LISTA_4[[#All],[AF]],0)+6),0)","v":0},"Podsumowanie miesiąca",null,{"$f":"COUNTA(LISTA_4[F])","v":0},{"$f":"SUM(LISTA_4[G])","v":0},{"$f":"SUM(LISTA_4[H])","v":0},{"$f":"SUM(LISTA_4[I])","v":0},{"$f":"SUM(LISTA_4[J])","v":0},{"$f":"SUM(LISTA_4[K])","v":0},{"$f":"SUM(LISTA_4[L])","v":0},{"$f":"SUM(LISTA_4[M])","v":0},{"$f":"SUM(LISTA_4[N])","v":0},{"$f":"SUM(LISTA_4[O])","v":0},{"$f":"SUM(LISTA_4[P])","v":0},{"$f":"SUM(LISTA_4[Q])","v":0},{"$f":"SUM(LISTA_4[R])","v":0},{"$f":"SUM(LISTA_4[S])","v":0},{"$f":"SUM(LISTA_4[T])","v":0},{"$f":"SUM(LISTA_4[U])","v":0},{"$f":"SUM(LISTA_4[V])","v":0},{"$f":"SUM(LISTA_4[W])","v":0},{"$f":"SUM(LISTA_4[X])","v":0},{"$f":"SUM(LISTA_4[Y])","v":0},{"$f":"SUM(LISTA_4[Z])","v":0},{"$f":"SUM(LISTA_4[AA])","v":0},{"$f":"SUM(LISTA_4[AB])","v":0},{"$f":"SUM(LISTA_4[AC])","v":0},{"$f":"SUM(LISTA_4[AD])","v":0},{"$f":"SUM(LISTA_4[AE])","v":0}]
["Lp.","Dnia","NUMER \nKARTY WĘDKARSKIEJ","NAZWISKO","IMIĘ","NUMER ZEZWOLENIA","HOLOGRAM ZEZW.","SKŁADKI CZŁONKOWSKIE",null,null,null,null,null,null,"SKŁADKI OKRĘGOWE",null,null,null,null,"WODY GÓRSKIE",null,null,"TROLLING",null,null,"WPISOWE",null,null,"LEGITYMACJE",null,"RAZEM"]
[null,null,null,null,null,null,null,170,128,85,85,43,43,43,240,180,156,120,55,60,30,"HOLOGRAM",1700,1400,"HOLOGRAM TROLLING",30,1,1,10,"BEZPŁATNA"]
[null,null,null,null,null,null,null,"Podstawowa","Srebrna odznaka PZW                                            ","Złota odznaka PZW                                         ","Niepełnosprawność znaczna","Młodzież \n(17-24 lata)                                 ","Wieńce               ","Uczestnik \n(do 16 lat)","Podstawowa","ULGA I \n srebrna odznaka","ULGA II\n wiek k.-60 m.-65\nniep. umiarkowana ","ULGA III  \nzłota, niep. znaczna","ULGA IV wieńce, młodzi.uczestnik","Podstawowa\nULGA I, ULGA II","ULGA III, ULGA IV",null,"PEŁNA \nwody nizinne, górskie i trolling","UZUPEŁNIAJĄCA\nwody nizinne",null,"CZŁONEK ZWYCZAJNY","CZŁONEK UCZESTNIK","UCZESTNIK NOWO WSTĘPUJĄCY","PŁATNA"]
["A","B","C","D","E","F","G","H","I","J","K","L","M","N","O","P","Q","R","S","T","U","V","W","X","Y","Z","AA","AB","AC","AD","AE","AF"]
[null,null,null,null,null,null,null,null,null,null,null,null,null,null,null,null,null,null,null,null,null,null,null,null,null,null,null,null,null,null,null,{"$f":"IFERROR((IF(LISTA_4[AE]=(LISTA_4[[#This Row],[H]]*$H$5)+(LISTA_4[[#This Row],[I]]*$I$5)+(LISTA_4[[#This Row],[J]]*$J$5)+(LISTA_4[[#This Row],[K]]*$K$5)+(LISTA_4[[#This Row],[L]]*$L$5)+(LISTA_4[[#This Row],[M]]*$M$5)+(LISTA_4[[#This Row],[N]]*$N$5)+(LISTA_4[[#This Row],[O]]*$O$5)+(LISTA_4[[#This Row],[P]]*$P$5)+(LISTA_4[[#This Row],[Q]]*$Q$5)+(LISTA_4[[#This Row],[R]]*$R$5)+(LISTA_4[[#This Row],[S]]*$S$5)+(LISTA_4[[#This Row],[T]]*$T$5)+(LISTA_4[[#This Row],[U]]*$U$5)+(LISTA_4[[#This Row],[W]]*$W$5)+(LISTA_4[[#This Row],[X]]*$X$5)+(LISTA_4[[#This Row],[AA]]*$AA$5)+(LISTA_4[[#This Row],[Z]]*$Z$5)+(LISTA_4[[#This Row],[AB]]*$AB$5)+(LISTA_4[[#This Row],[AC]]*$AC$5),\"Poprawnie\",\"Błąd\")),\"Błąd\")","v":"Poprawnie"}]

{"sheet":"Maj","index":5,"n_rows":8,"n_cols":32,"rows_kept":8,"cut":false,"hidden":false,"merged":[[4,24,5,24],[3,30,5,30],[4,21,5,21],[4,29,5,29],[2,0,2,1],[3,4,5,4],[2,3,2,4],[0,0,0,30],[3,0,5,0],[3,1,5,1],[3,2,5,2],[3,3,5,3],[3,5,5,5],[3,6,5,6],[3,7,3,13],[3,14,3,18],[3,19,3,21],[3,25,3,27],[3,28,3,29],[3,22,3,24]]}
["LISTA PRZYJĘTYCH SKŁADEK W MAJU 2024 R."]
[]
[{"$f":"IF((IFERROR((MATCH(\"Błąd\",LISTA_5[[#All],[AF]],0)+6),0))<8,\"Wyliczenia poprawne\",\"Wykryto błąd wiersz nr\")","v":"Wyliczenia poprawne"},null,{"$f":"IFERROR((MATCH(\"Błąd\",LISTA_5[[#All],[AF]],0)+6),0)","v":0},"Podsumowanie miesiąca",null,{"$f":"COUNTA(LISTA_5[F])","v":0},{"$f":"SUM(LISTA_5[G])","v":0},{"$f":"SUM(LISTA_5[H])","v":0},{"$f":"SUM(LISTA_5[I])","v":0},{"$f":"SUM(LISTA_5[J])","v":0},{"$f":"SUM(LISTA_5[K])","v":0},{"$f":"SUM(LISTA_5[L])","v":0},{"$f":"SUM(LISTA_5[M])","v":0},{"$f":"SUM(LISTA_5[N])","v":0},{"$f":"SUM(LISTA_5[O])","v":0},{"$f":"SUM(LISTA_5[P])","v":0},{"$f":"SUM(LISTA_5[Q])","v":0},{"$f":"SUM(LISTA_5[R])","v":0},{"$f":"SUM(LISTA_5[S])","v":0},{"$f":"SUM(LISTA_5[T])","v":0},{"$f":"SUM(LISTA_5[U])","v":0},{"$f":"SUM(LISTA_5[V])","v":0},{"$f":"SUM(LISTA_5[W])","v":0},{"$f":"SUM(LISTA_5[X])","v":0},{"$f":"SUM(LISTA_5[Y])","v":0},{"$f":"SUM(LISTA_5[Z])","v":0},{"$f":"SUM(LISTA_5[AA])","v":0},{"$f":"SUM(LISTA_5[AB])","v":0},{"$f":"SUM(LISTA_5[AC])","v":0},{"$f":"SUM(LISTA_5[AD])","v":0},{"$f":"SUM(LISTA_5[AE])","v":0}]
["Lp.","Dnia","NUMER \nKARTY WĘDKARSKIEJ","NAZWISKO","IMIĘ","NUMER ZEZWOLENIA","HOLOGRAM ZEZW.","SKŁADKI CZŁONKOWSKIE",null,null,null,null,null,null,"SKŁADKI OKRĘGOWE",null,null,null,null,"WODY GÓRSKIE",null,null,"TROLLING",null,null,"WPISOWE",null,null,"LEGITYMACJE",null,"RAZEM"]
[null,null,null,null,null,null,null,170,128,85,85,43,43,43,240,180,156,120,55,60,30,"HOLOGRAM",1700,1400,"HOLOGRAM\nTROLLING",30,1,1,10,"BEZPŁATNA"]
[null,null,null,null,null,null,null,"Podstawowa","Srebrna odznaka PZW                                            ","Złota odznaka PZW                                         ","Niepełnosprawność znaczna","Młodzież \n(17-24 lata)                                 ","Wieńce               ","Uczestnik \n(do 16 lat)","Podstawowa","ULGA I \n srebrna odznaka","ULGA II\n wiek k.-60 m.-65\nniep. umiarkowana ","ULGA III  \nzłota, niep. znaczna","ULGA IV wieńce, młodzi.uczestnik","Podstawowa\nULGA I, ULGA II","ULGA III, ULGA IV",null,"PEŁNA \nwody nizinne, górskie i trolling","UZUPEŁNIAJĄCA\nwody nizinne",null,"CZŁONEK ZWYCZAJNY","CZŁONEK UCZESTNIK","UCZESTNIK NOWO WSTĘPUJĄCY","PŁATNA"]
["A","B","C","D","E","F","G","H","I","J","K","L","M","N","O","P","Q","R","S","T","U","V","W","X","Y","Z","AA","AB","AC","AD","AE","AF"]
[null,null,null,null,null,null,null,null,null,null,null,null,null,null,null,null,null,null,null,null,null,null,null,null,null,null,null,null,null,null,null,{"$f":"IFERROR((IF(LISTA_5[AE]=(LISTA_5[[#This Row],[H]]*$H$5)+(LISTA_5[[#This Row],[I]]*$I$5)+(LISTA_5[[#This Row],[J]]*$J$5)+(LISTA_5[[#This Row],[K]]*$K$5)+(LISTA_5[[#This Row],[L]]*$L$5)+(LISTA_5[[#This Row],[M]]*$M$5)+(LISTA_5[[#This Row],[N]]*$N$5)+(LISTA_5[[#This Row],[O]]*$O$5)+(LISTA_5[[#This Row],[P]]*$P$5)+(LISTA_5[[#This Row],[Q]]*$Q$5)+(LISTA_5[[#This Row],[R]]*$R$5)+(LISTA_5[[#This Row],[S]]*$S$5)+(LISTA_5[[#This Row],[T]]*$T$5)+(LISTA_5[[#This Row],[U]]*$U$5)+(LISTA_5[[#This Row],[W]]*$W$5)+(LISTA_5[[#This Row],[X]]*$X$5)+(LISTA_5[[#This Row],[AA]]*$AA$5)+(LISTA_5[[#This Row],[Z]]*$Z$5)+(LISTA_5[[#This Row],[AB]]*$AB$5)+(LISTA_5[[#This Row],[AC]]*$AC$5),\"Poprawnie\",\"Błąd\")),\"Błąd\")","v":"Poprawnie"}]

{"sheet":"Czerwiec","index":6,"n_rows":8,"n_cols":32,"rows_kept":8,"cut":false,"hidden":false,"merged":[[4,24,5,24],[3,30,5,30],[4,21,5,21],[4,29,5,29],[2,0,2,1],[3,4,5,4],[2,3,2,4],[0,0,0,30],[3,0,5,0],[3,1,5,1],[3,2,5,2],[3,3,5,3],[3,5,5,5],[3,6,5,6],[3,7,3,13],[3,14,3,18],[3,19,3,21],[3,25,3,27],[3,28,3,29],[3,22,3,24]]}
["LISTA PRZYJĘTYCH SKŁADEK W CZERWCU 2024 R."]
[]
[{"$f":"IF((IFERROR((MATCH(\"Błąd\",LISTA_6[[#All],[AF]],0)+6),0))<8,\"Wyliczenia poprawne\",\"Wykryto błąd wiersz nr\")","v":"Wyliczenia poprawne"},null,{"$f":"IFERROR((MATCH(\"Błąd\",LISTA_6[[#All],[AF]],0)+6),0)","v":0},"Podsumowanie miesiąca",null,{"$f":"COUNTA(LISTA_6[F])","v":0},{"$f":"SUM(LISTA_6[G])","v":0},{"$f":"SUM(LISTA_6[H])","v":0},{"$f":"SUM(LISTA_6[I])","v":0},{"$f":"SUM(LISTA_6[J])","v":0},{"$f":"SUM(LISTA_6[K])","v":0},{"$f":"SUM(LISTA_6[L])","v":0},{"$f":"SUM(LISTA_6[M])","v":0},{"$f":"SUM(LISTA_6[N])","v":0},{"$f":"SUM(LISTA_6[O])","v":0},{"$f":"SUM(LISTA_6[P])","v":0},{"$f":"SUM(LISTA_6[Q])","v":0},{"$f":"SUM(LISTA_6[R])","v":0},{"$f":"SUM(LISTA_6[S])","v":0},{"$f":"SUM(LISTA_6[T])","v":0},{"$f":"SUM(LISTA_6[U])","v":0},{"$f":"SUM(LISTA_6[V])","v":0},{"$f":"SUM(LISTA_6[W])","v":0},{"$f":"SUM(LISTA_6[X])","v":0},{"$f":"SUM(LISTA_6[Y])","v":0},{"$f":"SUM(LISTA_6[Z])","v":0},{"$f":"SUM(LISTA_6[AA])","v":0},{"$f":"SUM(LISTA_6[AB])","v":0},{"$f":"SUM(LISTA_6[AC])","v":0},{"$f":"SUM(LISTA_6[AD])","v":0},{"$f":"SUM(LISTA_6[AE])","v":0}]
["Lp.","Dnia","NUMER \nKARTY WĘDKARSKIEJ","NAZWISKO","IMIĘ","NUMER ZEZWOLENIA","HOLOGRAM ZEZW.","SKŁADKI CZŁONKOWSKIE",null,null,null,null,null,null,"SKŁADKI OKRĘGOWE",null,null,null,null,"WODY GÓRSKIE",null,null,"TROLLING",null,null,"WPISOWE",null,null,"LEGITYMACJE",null,"RAZEM"]
[null,null,null,null,null,null,null,170,128,85,85,43,43,43,240,180,156,120,55,60,30,"HOLOGRAM",1700,1400,"HOLOGRAM\nTROLLING",30,1,1,10,"BEZPŁATNA"]
[null,null,null,null,null,null,null,"Podstawowa","Srebrna odznaka PZW                                            ","Złota odznaka PZW                                         ","Niepełnosprawność znaczna","Młodzież \n(17-24 lata)                                 ","Wieńce               ","Uczestnik \n(do 16 lat)","Podstawowa","ULGA I \n srebrna odznaka","ULGA II\n wiek k.-60 m.-65\nniep. umiarkowana ","ULGA III  \nzłota, niep. znaczna","ULGA IV wieńce, młodzi.uczestnik","Podstawowa\nULGA I, ULGA II","ULGA III, ULGA IV",null,"PEŁNA \nwody nizinne, górskie i trolling","UZUPEŁNIAJĄCA\nwody nizinne",null,"CZŁONEK ZWYCZAJNY","CZŁONEK UCZESTNIK","UCZESTNIK NOWO WSTĘPUJĄCY","PŁATNA"]
["A","B","C","D","E","F","G","H","I","J","K","L","M","N","O","P","Q","R","S","T","U","V","W","X","Y","Z","AA","AB","AC","AD","AE","AF"]
[null,null,null,null,null,null,null,null,null,null,null,null,null,null,null,null,null,null,null,null,null,null,null,null,null,null,null,null,null,null,null,{"$f":"IFERROR((IF(LISTA_6[AE]=(LISTA_6[[#This Row],[H]]*$H$5)+(LISTA_6[[#This Row],[I]]*$I$5)+(LISTA_6[[#This Row],[J]]*$J$5)+(LISTA_6[[#This Row],[K]]*$K$5)+(LISTA_6[[#This Row],[L]]*$L$5)+(LISTA_6[[#This Row],[M]]*$M$5)+(LISTA_6[[#This Row],[N]]*$N$5)+(LISTA_6[[#This Row],[O]]*$O$5)+(LISTA_6[[#This Row],[P]]*$P$5)+(LISTA_6[[#This Row],[Q]]*$Q$5)+(LISTA_6[[#This Row],[R]]*$R$5)+(LISTA_6[[#This Row],[S]]*$S$5)+(LISTA_6[[#This Row],[T]]*$T$5)+(LISTA_6[[#This Row],[U]]*$U$5)+(LISTA_6[[#This Row],[W]]*$W$5)+(LISTA_6[[#This Row],[X]]*$X$5)+(LISTA_6[[#This Row],[AA]]*$AA$5)+(LISTA_6[[#This Row],[Z]]*$Z$5)+(LISTA_6[[#This Row],[AB]]*$AB$5)+(LISTA_6[[#This Row],[AC]]*$AC$5),\"Poprawnie\",\"Błąd\")),\"Błąd\")","v":"Poprawnie"}]

{"sheet":"Lipiec","index":7,"n_rows":8,"n_cols":32,"rows_kept":8,"cut":false,"hidden":false,"merged":[[4,24,5,24],[3,30,5,30],[4,21,5,21],[4,29,5,29],[2,0,2,1],[3,4,5,4],[2,3,2,4],[0,0,0,30],[3,0,5,0],[3,1,5,1],[3,2,5,2],[3,3,5,3],[3,5,5,5],[3,6,5,6],[3,7,3,13],[3,14,3,18],[3,19,3,21],[3,25,3,27],[3,28,3,29],[3,22,3,24]]}
["LISTA PRZYJĘTYCH SKŁADEK W LIPCU 2024 R."]
[]
[{"$f":"IF((IFERROR((MATCH(\"Błąd\",LISTA_7[[#All],[AF]],0)+6),0))<8,\"Wyliczenia poprawne\",\"Wykryto błąd wiersz nr\")","v":"Wyliczenia poprawne"},null,{"$f":"IFERROR((MATCH(\"Błąd\",LISTA_7[[#All],[AF]],0)+6),0)","v":0},"Podsumowanie miesiąca",null,{"$f":"COUNTA(LISTA_7[F])","v":0},{"$f":"SUM(LISTA_7[G])","v":0},{"$f":"SUM(LISTA_7[H])","v":0},{"$f":"SUM(LISTA_7[I])","v":0},{"$f":"SUM(LISTA_7[J])","v":0},{"$f":"SUM(LISTA_7[K])","v":0},{"$f":"SUM(LISTA_7[L])","v":0},{"$f":"SUM(LISTA_7[M])","v":0},{"$f":"SUM(LISTA_7[N])","v":0},{"$f":"SUM(LISTA_7[O])","v":0},{"$f":"SUM(LISTA_7[P])","v":0},{"$f":"SUM(LISTA_7[Q])","v":0},{"$f":"SUM(LISTA_7[R])","v":0},{"$f":"SUM(LISTA_7[S])","v":0},{"$f":"SUM(LISTA_7[T])","v":0},{"$f":"SUM(LISTA_7[U])","v":0},{"$f":"SUM(LISTA_7[V])","v":0},{"$f":"SUM(LISTA_7[W])","v":0},{"$f":"SUM(LISTA_7[X])","v":0},{"$f":"SUM(LISTA_7[Y])","v":0},{"$f":"SUM(LISTA_7[Z])","v":0},{"$f":"SUM(LISTA_7[AA])","v":0},{"$f":"SUM(LISTA_7[AB])","v":0},{"$f":"SUM(LISTA_7[AC])","v":0},{"$f":"SUM(LISTA_7[AD])","v":0},{"$f":"SUM(LISTA_7[AE])","v":0}]
["Lp.","Dnia","NUMER \nKARTY WĘDKARSKIEJ","NAZWISKO","IMIĘ","NUMER ZEZWOLENIA","HOLOGRAM ZEZW.","SKŁADKI CZŁONKOWSKIE",null,null,null,null,null,null,"SKŁADKI OKRĘGOWE",null,null,null,null,"WODY GÓRSKIE",null,null,"TROLLING",null,null,"WPISOWE",null,null,"LEGITYMACJE",null,"RAZEM"]
[null,null,null,null,null,null,null,170,128,85,85,43,43,43,240,180,156,120,55,60,30,"HOLOGRAM",1700,1400,"HOLOGRAM\nTROLLING",30,1,1,10,"BEZPŁATNA"]
[null,null,null,null,null,null,null,"Podstawowa","Srebrna odznaka PZW                                            ","Złota odznaka PZW                                         ","Niepełnosprawność znaczna","Młodzież \n(17-24 lata)                                 ","Wieńce               ","Uczestnik \n(do 16 lat)","Podstawowa","ULGA I \n srebrna odznaka","ULGA II\n wiek k.-60 m.-65\nniep. umiarkowana ","ULGA III  \nzłota, niep. znaczna","ULGA IV wieńce, młodzi.uczestnik","Podstawowa\nULGA I, ULGA II","ULGA III, ULGA IV",null,"PEŁNA \nwody nizinne, górskie i trolling","UZUPEŁNIAJĄCA\nwody nizinne",null,"CZŁONEK ZWYCZAJNY","CZŁONEK UCZESTNIK","UCZESTNIK NOWO WSTĘPUJĄCY","PŁATNA"]
["A","B","C","D","E","F","G","H","I","J","K","L","M","N","O","P","Q","R","S","T","U","V","W","X","Y","Z","AA","AB","AC","AD","AE","AF"]
[null,null,null,null,null,null,null,null,null,null,null,null,null,null,null,null,null,null,null,null,null,null,null,null,null,null,null,null,null,null,null,{"$f":"IFERROR((IF(LISTA_7[AE]=(LISTA_7[[#This Row],[H]]*$H$5)+(LISTA_7[[#This Row],[I]]*$I$5)+(LISTA_7[[#This Row],[J]]*$J$5)+(LISTA_7[[#This Row],[K]]*$K$5)+(LISTA_7[[#This Row],[L]]*$L$5)+(LISTA_7[[#This Row],[M]]*$M$5)+(LISTA_7[[#This Row],[N]]*$N$5)+(LISTA_7[[#This Row],[O]]*$O$5)+(LISTA_7[[#This Row],[P]]*$P$5)+(LISTA_7[[#This Row],[Q]]*$Q$5)+(LISTA_7[[#This Row],[R]]*$R$5)+(LISTA_7[[#This Row],[S]]*$S$5)+(LISTA_7[[#This Row],[T]]*$T$5)+(LISTA_7[[#This Row],[U]]*$U$5)+(LISTA_7[[#This Row],[W]]*$W$5)+(LISTA_7[[#This Row],[X]]*$X$5)+(LISTA_7[[#This Row],[AA]]*$AA$5)+(LISTA_7[[#This Row],[Z]]*$Z$5)+(LISTA_7[[#This Row],[AB]]*$AB$5)+(LISTA_7[[#This Row],[AC]]*$AC$5),\"Poprawnie\",\"Błąd\")),\"Błąd\")","v":"Poprawnie"}]

{"sheet":"Sierpień","index":8,"n_rows":8,"n_cols":32,"rows_kept":8,"cut":false,"hidden":false,"merged":[[4,24,5,24],[3,30,5,30],[4,21,5,21],[4,29,5,29],[2,0,2,1],[3,4,5,4],[2,3,2,4],[0,0,0,30],[3,0,5,0],[3,1,5,1],[3,2,5,2],[3,3,5,3],[3,5,5,5],[3,6,5,6],[3,7,3,13],[3,14,3,18],[3,19,3,21],[3,25,3,27],[3,28,3,29],[3,22,3,24]]}
["LISTA PRZYJĘTYCH SKŁADEK W SIERPNIU 2024 R."]
[]
[{"$f":"IF((IFERROR((MATCH(\"Błąd\",LISTA_8[[#All],[AF]],0)+6),0))<8,\"Wyliczenia poprawne\",\"Wykryto błąd wiersz nr\")","v":"Wyliczenia poprawne"},null,{"$f":"IFERROR((MATCH(\"Błąd\",LISTA_8[[#All],[AF]],0)+6),0)","v":0},"Podsumowanie miesiąca",null,{"$f":"COUNTA(LISTA_8[F])","v":0},{"$f":"SUM(LISTA_8[G])","v":0},{"$f":"SUM(LISTA_8[H])","v":0},{"$f":"SUM(LISTA_8[I])","v":0},{"$f":"SUM(LISTA_8[J])","v":0},{"$f":"SUM(LISTA_8[K])","v":0},{"$f":"SUM(LISTA_8[L])","v":0},{"$f":"SUM(LISTA_8[M])","v":0},{"$f":"SUM(LISTA_8[N])","v":0},{"$f":"SUM(LISTA_8[O])","v":0},{"$f":"SUM(LISTA_8[P])","v":0},{"$f":"SUM(LISTA_8[Q])","v":0},{"$f":"SUM(LISTA_8[R])","v":0},{"$f":"SUM(LISTA_8[S])","v":0},{"$f":"SUM(LISTA_8[T])","v":0},{"$f":"SUM(LISTA_8[U])","v":0},{"$f":"SUM(LISTA_8[V])","v":0},{"$f":"SUM(LISTA_8[W])","v":0},{"$f":"SUM(LISTA_8[X])","v":0},{"$f":"SUM(LISTA_8[Y])","v":0},{"$f":"SUM(LISTA_8[Z])","v":0},{"$f":"SUM(LISTA_8[AA])","v":0},{"$f":"SUM(LISTA_8[AB])","v":0},{"$f":"SUM(LISTA_8[AC])","v":0},{"$f":"SUM(LISTA_8[AD])","v":0},{"$f":"SUM(LISTA_8[AE])","v":0}]
["Lp.","Dnia","NUMER \nKARTY WĘDKARSKIEJ","NAZWISKO","IMIĘ","NUMER ZEZWOLENIA","HOLOGRAM ZEZW.","SKŁADKI CZŁONKOWSKIE",null,null,null,null,null,null,"SKŁADKI OKRĘGOWE",null,null,null,null,"WODY GÓRSKIE",null,null,"TROLLING",null,null,"WPISOWE",null,null,"LEGITYMACJE",null,"RAZEM"]
[null,null,null,null,null,null,null,170,128,85,85,43,43,43,240,180,156,120,55,60,30,"HOLOGRAM",1700,1400,"HOLOGRAM\nTROLLING",30,1,1,10,"BEZPŁATNA"]
[null,null,null,null,null,null,null,"Podstawowa","Srebrna odznaka PZW                                            ","Złota odznaka PZW                                         ","Niepełnosprawność znaczna","Młodzież \n(17-24 lata)                                 ","Wieńce               ","Uczestnik \n(do 16 lat)","Podstawowa","ULGA I \n srebrna odznaka","ULGA II\n wiek k.-60 m.-65\nniep. umiarkowana ","ULGA III  \nzłota, niep. znaczna","ULGA IV wieńce, młodzi.uczestnik","Podstawowa\nULGA I, ULGA II","ULGA III, ULGA IV",null,"PEŁNA \nwody nizinne, górskie i trolling","UZUPEŁNIAJĄCA\nwody nizinne",null,"CZŁONEK ZWYCZAJNY","CZŁONEK UCZESTNIK","UCZESTNIK NOWO WSTĘPUJĄCY","PŁATNA"]
["A","B","C","D","E","F","G","H","I","J","K","L","M","N","O","P","Q","R","S","T","U","V","W","X","Y","Z","AA","AB","AC","AD","AE","AF"]
[null,null,null,null,null,null,null,null,null,null,null,null,null,null,null,null,null,null,null,null,null,null,null,null,null,null,null,null,null,null,null,{"$f":"IFERROR((IF(LISTA_8[AE]=(LISTA_8[[#This Row],[H]]*$H$5)+(LISTA_8[[#This Row],[I]]*$I$5)+(LISTA_8[[#This Row],[J]]*$J$5)+(LISTA_8[[#This Row],[K]]*$K$5)+(LISTA_8[[#This Row],[L]]*$L$5)+(LISTA_8[[#This Row],[M]]*$M$5)+(LISTA_8[[#This Row],[N]]*$N$5)+(LISTA_8[[#This Row],[O]]*$O$5)+(LISTA_8[[#This Row],[P]]*$P$5)+(LISTA_8[[#This Row],[Q]]*$Q$5)+(LISTA_8[[#This Row],[R]]*$R$5)+(LISTA_8[[#This Row],[S]]*$S$5)+(LISTA_8[[#This Row],[T]]*$T$5)+(LISTA_8[[#This Row],[U]]*$U$5)+(LISTA_8[[#This Row],[W]]*$W$5)+(LISTA_8[[#This Row],[X]]*$X$5)+(LISTA_8[[#This Row],[AA]]*$AA$5)+(LISTA_8[[#This Row],[Z]]*$Z$5)+(LISTA_8[[#This Row],[AB]]*$AB$5)+(LISTA_8[[#This Row],[AC]]*$AC$5),\"Poprawnie\",\"Błąd\")),\"Błąd\")","v":"Poprawnie"}]

{"sheet":"Wrzesień","index":9,"n_rows":8,"n_cols":32,"rows_kept":8,"cut":false,"hidden":false,"merged":[[4,24,5,24],[3,30,5,30],[4,21,5,21],[4,29,5,29],[2,0,2,1],[3,4,5,4],[2,3,2,4],[0,0,0,30],[3,0,5,0],[3,1,5,1],[3,2,5,2],[3,3,5,3],[3,5,5,5],[3,6,5,6],[3,7,3,13],[3,14,3,18],[3,19,3,21],[3,25,3,27],[3,28,3,29],[3,22,3,24]]}
["LISTA PRZYJĘTYCH SKŁADEK WE WRZEŚNIU 2024 R."]
[]
[{"$f":"IF((IFERROR((MATCH(\"Błąd\",LISTA_9[[#All],[AF]],0)+6),0))<8,\"Wyliczenia poprawne\",\"Wykryto błąd wiersz nr\")","v":"Wyliczenia poprawne"},null,{"$f":"IFERROR((MATCH(\"Błąd\",LISTA_9[[#All],[AF]],0)+6),0)","v":0},"Podsumowanie miesiąca",null,{"$f":"COUNTA(LISTA_9[F])","v":0},{"$f":"SUM(LISTA_9[G])","v":0},{"$f":"SUM(LISTA_9[H])","v":0},{"$f":"SUM(LISTA_9[I])","v":0},{"$f":"SUM(LISTA_9[J])","v":0},{"$f":"SUM(LISTA_9[K])","v":0},{"$f":"SUM(LISTA_9[L])","v":0},{"$f":"SUM(LISTA_9[M])","v":0},{"$f":"SUM(LISTA_9[N])","v":0},{"$f":"SUM(LISTA_9[O])","v":0},{"$f":"SUM(LISTA_9[P])","v":0},{"$f":"SUM(LISTA_9[Q])","v":0},{"$f":"SUM(LISTA_9[R])","v":0},{"$f":"SUM(LISTA_9[S])","v":0},{"$f":"SUM(LISTA_9[T])","v":0},{"$f":"SUM(LISTA_9[U])","v":0},{"$f":"SUM(LISTA_9[V])","v":0},{"$f":"SUM(LISTA_9[W])","v":0},{"$f":"SUM(LISTA_9[X])","v":0},{"$f":"SUM(LISTA_9[Y])","v":0},{"$f":"SUM(LISTA_9[Z])","v":0},{"$f":"SUM(LISTA_9[AA])","v":0},{"$f":"SUM(LISTA_9[AB])","v":0},{"$f":"SUM(LISTA_9[AC])","v":0},{"$f":"SUM(LISTA_9[AD])","v":0},{"$f":"SUM(LISTA_9[AE])","v":0}]
["Lp.","Dnia","NUMER \nKARTY WĘDKARSKIEJ","NAZWISKO","IMIĘ","NUMER ZEZWOLENIA","HOLOGRAM ZEZW.","SKŁADKI CZŁONKOWSKIE",null,null,null,null,null,null,"SKŁADKI OKRĘGOWE",null,null,null,null,"WODY GÓRSKIE",null,null,"TROLLING",null,null,"WPISOWE",null,null,"LEGITYMACJE",null,"RAZEM"]
[null,null,null,null,null,null,null,170,128,85,85,43,43,43,240,180,156,120,55,60,30,"HOLOGRAM",1700,1400,"HOLOGRAM\nTROLLING",30,1,1,10,"BEZPŁATNA"]
[null,null,null,null,null,null,null,"Podstawowa","Srebrna odznaka PZW                                            ","Złota odznaka PZW                                         ","Niepełnosprawność znaczna","Młodzież \n(17-24 lata)                                 ","Wieńce               ","Uczestnik \n(do 16 lat)","Podstawowa","ULGA I \n srebrna odznaka","ULGA II\n wiek k.-60 m.-65\nniep. umiarkowana ","ULGA III  \nzłota, niep. znaczna","ULGA IV wieńce, młodzi.uczestnik","Podstawowa\nULGA I, ULGA II","ULGA III, ULGA IV",null,"PEŁNA \nwody nizinne, górskie i trolling","UZUPEŁNIAJĄCA\nwody nizinne",null,"CZŁONEK ZWYCZAJNY","CZŁONEK UCZESTNIK","UCZESTNIK NOWO WSTĘPUJĄCY","PŁATNA"]
["A","B","C","D","E","F","G","H","I","J","K","L","M","N","O","P","Q","R","S","T","U","V","W","X","Y","Z","AA","AB","AC","AD","AE","AF"]
[null,null,null,null,null,null,null,null,null,null,null,null,null,null,null,null,null,null,null,null,null,null,null,null,null,null,null,null,null,null,null,{"$f":"IFERROR((IF(LISTA_9[AE]=(LISTA_9[[#This Row],[H]]*$H$5)+(LISTA_9[[#This Row],[I]]*$I$5)+(LISTA_9[[#This Row],[J]]*$J$5)+(LISTA_9[[#This Row],[K]]*$K$5)+(LISTA_9[[#This Row],[L]]*$L$5)+(LISTA_9[[#This Row],[M]]*$M$5)+(LISTA_9[[#This Row],[N]]*$N$5)+(LISTA_9[[#This Row],[O]]*$O$5)+(LISTA_9[[#This Row],[P]]*$P$5)+(LISTA_9[[#This Row],[Q]]*$Q$5)+(LISTA_9[[#This Row],[R]]*$R$5)+(LISTA_9[[#This Row],[S]]*$S$5)+(LISTA_9[[#This Row],[T]]*$T$5)+(LISTA_9[[#This Row],[U]]*$U$5)+(LISTA_9[[#This Row],[W]]*$W$5)+(LISTA_9[[#This Row],[X]]*$X$5)+(LISTA_9[[#This Row],[AA]]*$AA$5)+(LISTA_9[[#This Row],[Z]]*$Z$5)+(LISTA_9[[#This Row],[AB]]*$AB$5)+(LISTA_9[[#This Row],[AC]]*$AC$5),\"Poprawnie\",\"Błąd\")),\"Błąd\")","v":"Poprawnie"}]

{"sheet":"Październik","index":10,"n_rows":8,"n_cols":32,"rows_kept":8,"cut":false,"hidden":false,"merged":[[4,24,5,24],[3,30,5,30],[4,21,5,21],[4,29,5,29],[2,0,2,1],[3,4,5,4],[2,3,2,4],[0,0,0,30],[3,0,5,0],[3,1,5,1],[3,2,5,2],[3,3,5,3],[3,5,5,5],[3,6,5,6],[3,7,3,13],[3,14,3,18],[3,19,3,21],[3,25,3,27],[3,28,3,29],[3,22,3,24]]}
["LISTA PRZYJĘTYCH SKŁADEK W PAŹDZIERNIKU 2024 R."]
[]
[{"$f":"IF((IFERROR((MATCH(\"Błąd\",LISTA_10[[#All],[AF]],0)+6),0))<8,\"Wyliczenia poprawne\",\"Wykryto błąd wiersz nr\")","v":"Wyliczenia poprawne"},null,{"$f":"IFERROR((MATCH(\"Błąd\",LISTA_10[[#All],[AF]],0)+6),0)","v":0},"Podsumowanie miesiąca",null,{"$f":"COUNTA(LISTA_10[F])","v":0},{"$f":"SUM(LISTA_10[G])","v":0},{"$f":"SUM(LISTA_10[H])","v":0},{"$f":"SUM(LISTA_10[I])","v":0},{"$f":"SUM(LISTA_10[J])","v":0},{"$f":"SUM(LISTA_10[K])","v":0},{"$f":"SUM(LISTA_10[L])","v":0},{"$f":"SUM(LISTA_10[M])","v":0},{"$f":"SUM(LISTA_10[N])","v":0},{"$f":"SUM(LISTA_10[O])","v":0},{"$f":"SUM(LISTA_10[P])","v":0},{"$f":"SUM(LISTA_10[Q])","v":0},{"$f":"SUM(LISTA_10[R])","v":0},{"$f":"SUM(LISTA_10[S])","v":0},{"$f":"SUM(LISTA_10[T])","v":0},{"$f":"SUM(LISTA_10[U])","v":0},{"$f":"SUM(LISTA_10[V])","v":0},{"$f":"SUM(LISTA_10[W])","v":0},{"$f":"SUM(LISTA_10[X])","v":0},{"$f":"SUM(LISTA_10[Y])","v":0},{"$f":"SUM(LISTA_10[Z])","v":0},{"$f":"SUM(LISTA_10[AA])","v":0},{"$f":"SUM(LISTA_10[AB])","v":0},{"$f":"SUM(LISTA_10[AC])","v":0},{"$f":"SUM(LISTA_10[AD])","v":0},{"$f":"SUM(LISTA_10[AE])","v":0}]
["Lp.","Dnia","NUMER \nKARTY WĘDKARSKIEJ","NAZWISKO","IMIĘ","NUMER ZEZWOLENIA","HOLOGRAM ZEZW.","SKŁADKI CZŁONKOWSKIE",null,null,null,null,null,null,"SKŁADKI OKRĘGOWE",null,null,null,null,"WODY GÓRSKIE",null,null,"TROLLING",null,null,"WPISOWE",null,null,"LEGITYMACJE",null,"RAZEM"]
[null,null,null,null,null,null,null,170,128,85,85,43,43,43,240,180,156,120,55,60,30,"HOLOGRAM",1700,1400,"HOLOGRAM\nTROLLING",30,1,1,10,"BEZPŁATNA"]
[null,null,null,null,null,null,null,"Podstawowa","Srebrna odznaka PZW                                            ","Złota odznaka PZW                                         ","Niepełnosprawność znaczna","Młodzież \n(17-24 lata)                                 ","Wieńce               ","Uczestnik \n(do 16 lat)","Podstawowa","ULGA I \n srebrna odznaka","ULGA II\n wiek k.-60 m.-65\nniep. umiarkowana ","ULGA III  \nzłota, niep. znaczna","ULGA IV wieńce, młodzi.uczestnik","Podstawowa\nULGA I, ULGA II","ULGA III, ULGA IV",null,"PEŁNA \nwody nizinne, górskie i trolling","UZUPEŁNIAJĄCA\nwody nizinne",null,"CZŁONEK ZWYCZAJNY","CZŁONEK UCZESTNIK","UCZESTNIK NOWO WSTĘPUJĄCY","PŁATNA"]
["A","B","C","D","E","F","G","H","I","J","K","L","M","N","O","P","Q","R","S","T","U","V","W","X","Y","Z","AA","AB","AC","AD","AE","AF"]
[null,null,null,null,null,null,null,null,null,null,null,null,null,null,null,null,null,null,null,null,null,null,null,null,null,null,null,null,null,null,null,{"$f":"IFERROR((IF(LISTA_10[AE]=(LISTA_10[[#This Row],[H]]*$H$5)+(LISTA_10[[#This Row],[I]]*$I$5)+(LISTA_10[[#This Row],[J]]*$J$5)+(LISTA_10[[#This Row],[K]]*$K$5)+(LISTA_10[[#This Row],[L]]*$L$5)+(LISTA_10[[#This Row],[M]]*$M$5)+(LISTA_10[[#This Row],[N]]*$N$5)+(LISTA_10[[#This Row],[O]]*$O$5)+(LISTA_10[[#This Row],[P]]*$P$5)+(LISTA_10[[#This Row],[Q]]*$Q$5)+(LISTA_10[[#This Row],[R]]*$R$5)+(LISTA_10[[#This Row],[S]]*$S$5)+(LISTA_10[[#This Row],[T]]*$T$5)+(LISTA_10[[#This Row],[U]]*$U$5)+(LISTA_10[[#This Row],[W]]*$W$5)+(LISTA_10[[#This Row],[X]]*$X$5)+(LISTA_10[[#This Row],[AA]]*$AA$5)+(LISTA_10[[#This Row],[Z]]*$Z$5)+(LISTA_10[[#This Row],[AB]]*$AB$5)+(LISTA_10[[#This Row],[AC]]*$AC$5),\"Poprawnie\",\"Błąd\")),\"Błąd\")","v":"Poprawnie"}]

{"sheet":"Podsumowanie","index":11,"n_rows":19,"n_cols":28,"rows_kept":19,"cut":false,"hidden":false,"merged":[[0,0,0,27],[4,0,6,0],[4,2,6,2],[4,3,6,3],[4,4,4,10],[4,11,4,15],[4,16,4,18],[4,22,4,24],[4,25,4,26],[4,27,6,27],[5,18,6,18],[5,26,6,26],[4,1,6,1],[4,19,4,21],[5,21,6,21]]}
["PODSUMOWANIE LIST SKŁADEK W 2024 R."]
[]
[]
[]
["MIESIĄC","Liczba członków","LICZBA ZEZWOLEŃ","HOLOGRAM ZEZW.","SKŁADKI CZŁONKOWSKIE",null,null,null,null,null,null,"SKŁADKI OKRĘGOWE",null,null,null,null,"WODY GÓRSKIE",null,null,"TROLLING",null,null,"WPISOWE",null,null,"LEGITY                   MACJE",null,"RAZEM WARTOŚĆ"]
[null,null,null,null,170,128,85,85,43,43,43,240,180,156,120,55,60,45,"HALOGRAMY",1700,1400,"HOLOGRAM\nTROLLING",30,1,1,10,"BEZPŁATNA"]
[null,null,null,null,"Podstawowa","Srebrna odznaka PZW                                            ","Złota odznaka PZW                                         ","Niepełnosprawność znaczna","Młodzież \n(17-24 lata)                                 ","Wieńce               ","Uczestnik \n(do 16 lat)","Podstawowa","ULGA I                       srebrna odznaka","ULGA II\n wiek k.-60 m.-65\nniep. umiarkowana ","ULGA III  \nzłota, niep. Znaczna","ULGA IV wieńce, młodzi.uczestnik","Podstawowa","ULGA I                       srebrna odznaka",null,"PEŁNA \nwody nizinne, górskie i trolling","UZUPEŁNIAJĄCA\nwody nizinne",null,"CZŁONEK ZWYCZAJNY","CZŁONEK UCZESTNIK","UCZESTNIK NOWO WSTĘPUJĄCY","PŁATNA"]
["A","B","C","D","E","F","G","H","I","J","K","L","M","N","O","P","Q","R","S","T","U","V","W","X","Y","Z","AA","AB"]
["STYCZEŃ",{"$f":"SUM(E9:K9)","v":0},{"$f":"Styczeń!F3","v":0},{"$f":"Styczeń!G3","v":0},{"$f":"Styczeń!H3","v":0},{"$f":"Styczeń!I3","v":0},{"$f":"Styczeń!J3","v":0},{"$f":"Styczeń!K3","v":0},{"$f":"Styczeń!L3","v":0},{"$f":"Styczeń!M3","v":0},{"$f":"Styczeń!N3","v":0},{"$f":"Styczeń!O3","v":0},{"$f":"Styczeń!P3","v":0},{"$f":"Styczeń!Q3","v":0},{"$f":"Styczeń!R3","v":0},{"$f":"Styczeń!S3","v":0},{"$f":"Styczeń!T3","v":0},{"$f":"Styczeń!U3","v":0},{"$f":"Styczeń!V3","v":0},{"$f":"Styczeń!W3","v":0},{"$f":"Styczeń!X3","v":0},{"$f":"Styczeń!Y3","v":0},{"$f":"Styczeń!Z3","v":0},{"$f":"Styczeń!AA3","v":0},{"$f":"Styczeń!AB3","v":0},{"$f":"Styczeń!AC3","v":0},{"$f":"Styczeń!AD3","v":0},{"$f":"Styczeń!AE3","v":0}]
["LUTY",0,{"$f":"Luty!F3","v":0},{"$f":"Luty!G3","v":0},{"$f":"Luty!H3","v":0},{"$f":"Luty!I3","v":0},{"$f":"Luty!J3","v":0},{"$f":"Luty!K3","v":0},{"$f":"Luty!L3","v":0},{"$f":"Luty!M3","v":0},{"$f":"Luty!N3","v":0},{"$f":"Luty!O3","v":0},{"$f":"Luty!P3","v":0},{"$f":"Luty!Q3","v":0},{"$f":"Luty!R3","v":0},{"$f":"Luty!S3","v":0},{"$f":"Luty!T3","v":0},{"$f":"Luty!U3","v":0},{"$f":"Luty!V3","v":0},{"$f":"Luty!W3","v":0},{"$f":"Luty!X3","v":0},{"$f":"Luty!Y3","v":0},{"$f":"Luty!Z3","v":0},{"$f":"Luty!AA3","v":0},{"$f":"Luty!AB3","v":0},{"$f":"Luty!AC3","v":0},{"$f":"Luty!AD3","v":0},{"$f":"Luty!AE3","v":0}]
["MARZEC",0,{"$f":"Marzec!F3","v":0},{"$f":"Marzec!G3","v":0},{"$f":"Marzec!H3","v":0},{"$f":"Marzec!I3","v":0},{"$f":"Marzec!J3","v":0},{"$f":"Marzec!K3","v":0},{"$f":"Marzec!L3","v":0},{"$f":"Marzec!M3","v":0},{"$f":"Marzec!N3","v":0},{"$f":"Marzec!O3","v":0},{"$f":"Marzec!P3","v":0},{"$f":"Marzec!Q3","v":0},{"$f":"Marzec!R3","v":0},{"$f":"Marzec!S3","v":0},{"$f":"Marzec!T3","v":0},{"$f":"Marzec!U3","v":0},{"$f":"Marzec!V3","v":0},{"$f":"Marzec!W3","v":0},{"$f":"Marzec!X3","v":0},{"$f":"Marzec!Y3","v":0},{"$f":"Marzec!Z3","v":0},{"$f":"Marzec!AA3","v":0},{"$f":"Marzec!AB3","v":0},{"$f":"Marzec!AC3","v":0},{"$f":"Marzec!AD3","v":0},{"$f":"Marzec!AE3","v":0}]
["KWIECIEŃ",0,{"$f":"Kwiecień!F3","v":0},{"$f":"Kwiecień!G3","v":0},{"$f":"Kwiecień!H3","v":0},{"$f":"Kwiecień!I3","v":0},{"$f":"Kwiecień!J3","v":0},{"$f":"Kwiecień!K3","v":0},{"$f":"Kwiecień!L3","v":0},{"$f":"Kwiecień!M3","v":0},{"$f":"Kwiecień!N3","v":0},{"$f":"Kwiecień!O3","v":0},{"$f":"Kwiecień!P3","v":0},{"$f":"Kwiecień!Q3","v":0},{"$f":"Kwiecień!R3","v":0},{"$f":"Kwiecień!S3","v":0},{"$f":"Kwiecień!T3","v":0},{"$f":"Kwiecień!U3","v":0},{"$f":"Kwiecień!V3","v":0},{"$f":"Kwiecień!W3","v":0},{"$f":"Kwiecień!X3","v":0},{"$f":"Kwiecień!Y3","v":0},{"$f":"Kwiecień!Z3","v":0},{"$f":"Kwiecień!AA3","v":0},{"$f":"Kwiecień!AB3","v":0},{"$f":"Kwiecień!AC3","v":0},{"$f":"Kwiecień!AD3","v":0},{"$f":"Kwiecień!AE3","v":0}]
["MAJ",0,{"$f":"Maj!F3","v":0},{"$f":"Maj!G3","v":0},{"$f":"Maj!H3","v":0},{"$f":"Maj!I3","v":0},{"$f":"Maj!J3","v":0},{"$f":"Maj!K3","v":0},{"$f":"Maj!L3","v":0},{"$f":"Maj!M3","v":0},{"$f":"Maj!N3","v":0},{"$f":"Maj!O3","v":0},{"$f":"Maj!P3","v":0},{"$f":"Maj!Q3","v":0},{"$f":"Maj!R3","v":0},{"$f":"Maj!S3","v":0},{"$f":"Maj!T3","v":0},{"$f":"Maj!U3","v":0},{"$f":"Maj!V3","v":0},{"$f":"Maj!W3","v":0},{"$f":"Maj!X3","v":0},{"$f":"Maj!Y3","v":0},{"$f":"Maj!Z3","v":0},{"$f":"Maj!AA3","v":0},{"$f":"Maj!AB3","v":0},{"$f":"Maj!AC3","v":0},{"$f":"Maj!AD3","v":0},{"$f":"Maj!AE3","v":0}]
["CZERWIEC",0,{"$f":"Czerwiec!F3","v":0},{"$f":"Czerwiec!G3","v":0},{"$f":"Czerwiec!H3","v":0},{"$f":"Czerwiec!I3","v":0},{"$f":"Czerwiec!J3","v":0},{"$f":"Czerwiec!K3","v":0},{"$f":"Czerwiec!L3","v":0},{"$f":"Czerwiec!M3","v":0},{"$f":"Czerwiec!N3","v":0},{"$f":"Czerwiec!O3","v":0},{"$f":"Czerwiec!P3","v":0},{"$f":"Czerwiec!Q3","v":0},{"$f":"Czerwiec!R3","v":0},{"$f":"Czerwiec!S3","v":0},{"$f":"Czerwiec!T3","v":0},{"$f":"Czerwiec!U3","v":0},{"$f":"Czerwiec!V3","v":0},{"$f":"Czerwiec!W3","v":0},{"$f":"Czerwiec!X3","v":0},{"$f":"Czerwiec!Y3","v":0},{"$f":"Czerwiec!Z3","v":0},{"$f":"Czerwiec!AA3","v":0},{"$f":"Czerwiec!AB3","v":0},{"$f":"Czerwiec!AC3","v":0},{"$f":"Czerwiec!AD3","v":0},{"$f":"Czerwiec!AE3","v":0}]
["LIPIEC",0,{"$f":"Lipiec!F3","v":0},{"$f":"Lipiec!G3","v":0},{"$f":"Lipiec!H3","v":0},{"$f":"Lipiec!I3","v":0},{"$f":"Lipiec!J3","v":0},{"$f":"Lipiec!K3","v":0},{"$f":"Lipiec!L3","v":0},{"$f":"Lipiec!M3","v":0},{"$f":"Lipiec!N3","v":0},{"$f":"Lipiec!O3","v":0},{"$f":"Lipiec!P3","v":0},{"$f":"Lipiec!Q3","v":0},{"$f":"Lipiec!R3","v":0},{"$f":"Lipiec!S3","v":0},{"$f":"Lipiec!T3","v":0},{"$f":"Lipiec!U3","v":0},{"$f":"Lipiec!V3","v":0},{"$f":"Lipiec!W3","v":0},{"$f":"Lipiec!X3","v":0},{"$f":"Lipiec!Y3","v":0},{"$f":"Lipiec!Z3","v":0},{"$f":"Lipiec!AA3","v":0},{"$f":"Lipiec!AB3","v":0},{"$f":"Lipiec!AC3","v":0},{"$f":"Lipiec!AD3","v":0},{"$f":"Lipiec!AE3","v":0}]
["SIERPIEŃ",0,{"$f":"Sierpień!F3","v":0},{"$f":"Sierpień!G3","v":0},{"$f":"Sierpień!H3","v":0},{"$f":"Sierpień!I3","v":0},{"$f":"Sierpień!J3","v":0},{"$f":"Sierpień!K3","v":0},{"$f":"Sierpień!L3","v":0},{"$f":"Sierpień!M3","v":0},{"$f":"Sierpień!N3","v":0},{"$f":"Sierpień!O3","v":0},{"$f":"Sierpień!P3","v":0},{"$f":"Sierpień!Q3","v":0},{"$f":"Sierpień!R3","v":0},{"$f":"Sierpień!S3","v":0},{"$f":"Sierpień!T3","v":0},{"$f":"Sierpień!U3","v":0},{"$f":"Sierpień!V3","v":0},{"$f":"Sierpień!W3","v":0},{"$f":"Sierpień!X3","v":0},{"$f":"Sierpień!Y3","v":0},{"$f":"Sierpień!Z3","v":0},{"$f":"Sierpień!AA3","v":0},{"$f":"Sierpień!AB3","v":0},{"$f":"Sierpień!AC3","v":0},{"$f":"Sierpień!AD3","v":0},{"$f":"Sierpień!AE3","v":0}]
["WRZESIEŃ",0,{"$f":"Wrzesień!F3","v":0},{"$f":"Wrzesień!G3","v":0},{"$f":"Wrzesień!H3","v":0},{"$f":"Wrzesień!I3","v":0},{"$f":"Wrzesień!J3","v":0},{"$f":"Wrzesień!K3","v":0},{"$f":"Wrzesień!L3","v":0},{"$f":"Wrzesień!M3","v":0},{"$f":"Wrzesień!N3","v":0},{"$f":"Wrzesień!O3","v":0},{"$f":"Wrzesień!P3","v":0},{"$f":"Wrzesień!Q3","v":0},{"$f":"Wrzesień!R3","v":0},{"$f":"Wrzesień!S3","v":0},{"$f":"Wrzesień!T3","v":0},{"$f":"Wrzesień!U3","v":0},{"$f":"Wrzesień!V3","v":0},{"$f":"Wrzesień!W3","v":0},{"$f":"Wrzesień!X3","v":0},{"$f":"Wrzesień!Y3","v":0},{"$f":"Wrzesień!Z3","v":0},{"$f":"Wrzesień!AA3","v":0},{"$f":"Wrzesień!AB3","v":0},{"$f":"Wrzesień!AC3","v":0},{"$f":"Wrzesień!AD3","v":0},{"$f":"Wrzesień!AE3","v":0}]
["PAŹDZIERNIK",0,{"$f":"Październik!F3","v":0},{"$f":"Październik!G3","v":0},{"$f":"Październik!H3","v":0},{"$f":"Październik!I3","v":0},{"$f":"Październik!J3","v":0},{"$f":"Październik!K3","v":0},{"$f":"Październik!L3","v":0},{"$f":"Październik!M3","v":0},{"$f":"Październik!N3","v":0},{"$f":"Październik!O3","v":0},{"$f":"Październik!P3","v":0},{"$f":"Październik!Q3","v":0},{"$f":"Październik!R3","v":0},{"$f":"Październik!S3","v":0},{"$f":"Październik!T3","v":0},{"$f":"Październik!U3","v":0},{"$f":"Październik!V3","v":0},{"$f":"Październik!W3","v":0},{"$f":"Październik!X3","v":0},{"$f":"Październik!Y3","v":0},{"$f":"Październik!Z3","v":0},{"$f":"Październik!AA3","v":0},{"$f":"Październik!AB3","v":0},{"$f":"Październik!AC3","v":0},{"$f":"Październik!AD3","v":0},{"$f":"Październik!AE3","v":0}]
["PODSUMOWANIE ROCZNE",{"$f":"SUBTOTAL(109,LISTA_SUMA[B])","v":0},{"$f":"SUBTOTAL(109,LISTA_SUMA[C])","v":0},{"$f":"SUBTOTAL(109,LISTA_SUMA[D])","v":0},{"$f":"SUBTOTAL(109,LISTA_SUMA[E])","v":0},{"$f":"SUBTOTAL(109,LISTA_SUMA[F])","v":0},{"$f":"SUBTOTAL(109,LISTA_SUMA[G])","v":0},{"$f":"SUBTOTAL(109,LISTA_SUMA[H])","v":0},{"$f":"SUBTOTAL(109,LISTA_SUMA[I])","v":0},{"$f":"SUBTOTAL(109,LISTA_SUMA[J])","v":0},{"$f":"SUBTOTAL(109,LISTA_SUMA[K])","v":0},{"$f":"SUBTOTAL(109,LISTA_SUMA[L])","v":0},{"$f":"SUBTOTAL(109,LISTA_SUMA[M])","v":0},{"$f":"SUBTOTAL(109,LISTA_SUMA[N])","v":0},{"$f":"SUBTOTAL(109,LISTA_SUMA[O])","v":0},{"$f":"SUBTOTAL(109,LISTA_SUMA[P])","v":0},{"$f":"SUBTOTAL(109,LISTA_SUMA[Q])","v":0},{"$f":"SUBTOTAL(109,LISTA_SUMA[R])","v":0},{"$f":"SUBTOTAL(109,LISTA_SUMA[S])","v":0},{"$f":"SUBTOTAL(109,LISTA_SUMA[T])","v":0},{"$f":"SUBTOTAL(109,LISTA_SUMA[U])","v":0},{"$f":"SUBTOTAL(109,LISTA_SUMA[V])","v":0},{"$f":"SUBTOTAL(109,LISTA_SUMA[W])","v":0},{"$f":"SUBTOTAL(109,LISTA_SUMA[X])","v":0},{"$f":"SUBTOTAL(109,LISTA_SUMA[Y])","v":0},{"$f":"SUBTOTAL(109,LISTA_SUMA[Z])","v":0},{"$f":"SUBTOTAL(109,LISTA_SUMA[AA])","v":0},{"$f":"SUBTOTAL(109,LISTA_SUMA[AB])","v":0}]

{"sheet":"Składki","index":12,"n_rows":21,"n_cols":2,"rows_kept":21,"cut":false,"hidden":true,"merged":[]}
["Podstawowa",170]
["Srebrna odznaka PZW                                            ",128]
["Złota odznaka PZW                                         ",85]
["Niepełnosprawni",85]
["Młodzież (17-24 lata)                                 ",43]
["Wieńce               ",43]
["Uczestnik (do 16 lat)",43]
["Podstawowa",240]
["ULGA I srebrna odznaka",180]
["ULGA II wiek k.-60 m.-65 ",156]
["ULGA III  złota, niepełnosprawni",120]
["ULGA IV wieńce, młodzi.uczestnik",55]
["Podstawowa, Ulga1, Ulga2",60]
["Górskie Ulga 3, Ulga 4",30]
["Usunieta w kodzie",0]
["Pełna - wody NGT",1700]
["Uzupełniająca trolling",1400]
["CZŁONEK ZWYCZAJNY",30]
["CZŁONEK UCZESTNIK",1]
["UCZESTNIK NOWO WSTĘPUJĄCY",1]
["PŁATNA",10]

{"sheet":"Pełna Lista","index":13,"n_rows":1,"n_cols":7,"rows_kept":1,"cut":false,"hidden":false,"merged":[]}
["Nazwisko","Imię","Nr Karty","Nr zezwolenia","Wartość składki","Miesiąc","Nr na liście"]

{"sheet":"Odpis_procentowy","index":14,"n_rows":26,"n_cols":9,"rows_kept":26,"cut":false,"hidden":true,"merged":[[12,5,12,8],[13,5,13,8],[14,5,14,8],[15,5,15,8],[0,0,1,8],[2,0,2,8],[5,0,5,1],[5,2,5,8],[4,4,4,8],[16,1,16,4],[16,6,16,7],[17,0,21,0],[17,1,21,1],[17,5,17,8],[18,5,18,8],[19,5,19,8],[20,5,20,8],[21,2,21,4],[21,5,21,8],[7,0,16,0],[7,2,7,8],[8,5,8,8],[9,5,9,8],[10,5,10,8],[11,5,11,8],[22,0,24,0],[22,2,22,4],[22,5,22,8],[23,2,23,4],[23,5,23,8],[24,2,24,4],[24,5,24,8]]}
["ODPIS PROCENTOWY DLA KOŁA"]
[]
["Załącznik do rozliczenia znaków"]
[]
["Pieczątka koła",null,null,null,"Data wygenerowania  06.12.2023"]
["Składniki wyliczenia",null,"Wartość"]
["A","Wartość składek",null,null,null,null,null,null,508]
["B","Odpis procentowy koła:",0.5]
[null,"Składki członkowskie:","Cena","x","szt.","Wartość"]
[null,"Podstawowa",170,"x",1,{"$f":"C10*E10","v":170}]
[null,"Srebrna odznaka  PZW",128,"x",0,{"$f":"C11*E11","v":0}]
[null,"Złota odznaka PZW",85,"x",0,0]
[null,"Niepełnosprawność znaczna",85,"x",0,0]
[null,"Młodzież",43,"x",0,0]
[null,"Wieńce",43,"x",0,0]
[null,"Uczestnik",43,"x",1,43]
[null,"Razem B =",null,null,null,{"$f":"SUM(F10:H16)","v":213},{"$f":"C8","v":0.5},null,{"$f":"F17*G17","v":106.5}]
["C","Wyliczenia 100% odpisu dla koła z wpisowego","Cena","x","szt.","Wartość"]
[null,null,30,"x",0,{"$f":"E19*C19","v":0}]
[null,null,1,"x",0,{"$f":"E20*C20","v":0}]
[null,null,1,"x",0,{"$f":"E21*C21","v":0}]
[null,null,"Razem C =",null,null,{"$f":"SUM(F19:F21)","v":0}]
["D","Wartość składek","A",null,null,{"$f":"I7","v":508}]
[null,"Kwota dla Koła:","B+C",null,null,{"$f":"I17+F22","v":106.5}]
[null,"Kwota do wpłacenia do Okręgu:","A-(B+C)",null,null,{"$f":"F23-F24","v":401.5}]
["SPRAWDZONO:",null,"SKARBIK KOŁA:",null,null,null,"PREZES KOŁA:"]

{"sheet":"Rozliczenie","index":15,"n_rows":41,"n_cols":7,"rows_kept":41,"cut":false,"hidden":true,"merged":[[12,0,12,6],[3,0,3,3],[4,0,4,6],[5,0,5,3],[6,0,6,3],[7,0,7,3],[8,0,8,3],[9,0,9,3],[10,0,10,3],[11,0,11,3],[18,0,18,6],[19,0,19,3],[20,0,20,3],[21,0,21,3],[23,0,23,3],[22,0,22,6],[13,0,13,3],[14,0,14,3],[15,0,15,3],[16,0,16,3],[17,0,17,3],[0,0,0,6],[36,0,36,2],[36,3,36,6],[37,0,37,2],[37,3,37,6],[31,2,31,3],[32,2,32,3],[26,1,26,3],[27,1,27,3],[28,1,28,3],[29,1,29,3],[25,0,25,3],[26,0,28,0],[29,0,30,0],[30,1,30,3],[24,0,24,3],[40,0,40,6],[32,0,33,0],[32,4,33,4],[33,2,33,3],[34,1,34,4],[38,0,38,2],[38,3,38,6],[39,0,39,6]]}
["ROZLICZENIE ZNAKÓW NR  6"]
[]
["pieczątka koła i numer koła",null,null,null,"Data wygenerowania  06.12.2023"]
["Rodzaj",null,null,null,"Cena","Sztuk","Wartość"]
["SKŁADKI CZŁONKOWSKIE"]
["Podstawowa",null,null,null,170,1,{"$f":"E6*F6","v":170}]
["Srebrna odznaka PZW                                            ",null,null,null,128,0,0]
["Złota odznaka PZW                                         ",null,null,null,85,0,0]
["Niepełnosprawność znaczna",null,null,null,85,0,0]
["Młodzież (17-24 lata)                                 ",null,null,null,43,0,0]
["Wieńce               ",null,null,null,43,0,0]
["Uczestnik (do 16 lat)",null,null,null,43,1,43]
["SKŁADKI OKRĘGOWE NA OCHRONĘ I ZAGOSPODAROWANIE WÓD"]
["Podstawowa",null,null,null,240,1,240]
["Ulga I -srebrna odznaka PZW",null,null,null,180,0,0]
["Ulga II - wiek - k-60 lat i m-65 lat, niepełnosprawność umiarkowana",null,null,null,156,0,0]
["Ulga III - złota odznaka PZW, współmałżonek, niepełnosprawność znaczna                                                                                  ",null,null,null,120,0,0]
["Ulga IV - młodzież, wieńce, uczestnik                                                                                               ",null,null,null,55,1,55]
["SKŁADKA UZUPEŁNIAJĄCA - WODY GÓRSKIE"]
["Do podstawowej, Ulgi I, Ulgi II",null,null,null,60,0,0]
["Do Ulgi III i Ulgi IV",null,null,null,30,0,0]
["Hologramy - wody górskie                                                                                                                                                                           ",null,null,null,"X",0,"X"]
["SKŁADKA ROCZNA Z TROLLINGIEM obowiązującym w weekendy od 1.V - 31.X"]
["PEŁNA - wody nizinne, wody górskie i trolling",null,null,null,1700,0,{"$f":"E24*F24","v":0}]
["UZUPEŁNIAJĄCA - do składki rocznej na wody nizinne",null,null,null,1400,0,0]
["Hologramy - trolling                                                                                                                                                                         ",null,null,null,"X",0,"X"]
["Wpisowe","- członka zwyczajnego",null,null,30,0,0]
[null,"- członka uczestnika",null,null,1,0,0]
[null,"- członek uczestnik nowo wstępujący",null,null,1,0,0]
["Legitymacja","- członkowska",null,null,10,0,0]
[null,"- członkowska bezpłatna",null,null,"X",1,0]
["Zezwolenia",2,"",null,"Hologramy",2,"X"]
["Duplikaty zezwoleń",1,252852,null,"Hologramy",1,"X"]
[null,"Sztuk","Zakres numerów",null,null,"Sztuk","X"]
["Razem słownie:",{"$f":"TRIM(IF(INT(G35)=0,\"zero\",IF(MID(TEXT(INT(G35),\"000000000000\"),1,3)+0>1,IF(LEFT(TEXT(MID(TEXT(INT(G35),\"000000000000\"),1,3)+0,\"000\"),1)+0>0,INDEX({\"sto\";\"dwieście\";\"trzysta\";\"czterysta\";\"pięćset\";\"sześćset\";\"siedemset\";\"osiemset\";\"dziewięćset\"},LEFT(TEXT(MID(TEXT(INT(G35),\"000000000000\"),1,3)+0,\"000\"),1)+0)&\" \",\"\")&IF(RIGHT(TEXT(MID(TEXT(INT(G35),\"000000000000\"),1,3)+0,\"00\"),2)+0<20,INDEX({\"\";\"jeden\";\"dwa\";\"trzy\";\"cztery\";\"pięć\";\"sześć\";\"siedem\";\"osiem\";\"dziewięć\";\"dziesięć\";\"jedenaście\";\"dwanaście\";\"trzynaście\";\"czternaście\";\"piętnaście\";\"szesnaście\";\"siedemnaście\";\"osiemnaście\";\"dziewiętnaście\"},RIGHT(TEXT(MID(TEXT(INT(G35),\"000000000000\"),1,3)+0,\"00\"),2)+1),INDEX({\"dwadzieścia\";\"trzydzieści\";\"czterdzieści\";\"pięćdziesiąt\";\"sześćdziesiąt\";\"siedemdziesiąt\";\"osiemdziesiąt\";\"dziewięćdziesiąt\"},LEFT(RIGHT(TEXT(MID(TEXT(INT(G35),\"000000000000\"),1,3)+0,\"00\"),2),1)+0-1)&\" \"&INDEX({\"\";\"jeden\";\"dwa\";\"trzy\";\"cztery\";\"pięć\";\"sześć\";\"siedem\";\"osiem\";\"dziewięć\"},RIGHT(TEXT(MID(TEXT(INT(G35),\"000000000000\"),1,3)+0,\"0\"),1)+0+1)),\"\")&\" \"&IF(MID(TEXT(INT(G35),\"000000000000\"),1,3)+0>0,INDEX({\"miliardów\";\"miliard\";\"miliardy\"},(MID(TEXT(INT(G35),\"000000000000\"),1,3)+0=1)+(AND(RIGHT(TEXT(MID(TEXT(INT(G35),\"000000000000\"),1,3)+0,\"0\"),1)+0>=2,RIGHT(TEXT(MID(TEXT(INT(G35),\"000000000000\"),1,3)+0,\"0\"),1)+0<=4,LEFT(RIGHT(TEXT(MID(TEXT(INT(G35),\"000000000000\"),1,3)+0,\"00\"),2),1)+0<>1))*2+1),\"\")&\" \"&IF(MID(TEXT(INT(G35),\"000000000000\"),4,3)+0>1,IF(LEFT(TEXT(MID(TEXT(INT(G35),\"000000000000\"),4,3)+0,\"000\"),1)+0>0,INDEX({\"sto\";\"dwieście\";\"trzysta\";\"czterysta\";\"pięćset\";\"sześćset\";\"siedemset\";\"osiemset\";\"dziewięćset\"},LEFT(TEXT(MID(TEXT(INT(G35),\"000000000000\"),4,3)+0,\"000\"),1)+0)&\" \",\"\")&IF(RIGHT(TEXT(MID(TEXT(INT(G35),\"000000000000\"),4,3)+0,\"00\"),2)+0<20,INDEX({\"\";\"jeden\";\"dwa\";\"trzy\";\"cztery\";\"pięć\";\"sześć\";\"siedem\";\"osiem\";\"dziewięć\";\"dziesięć\";\"jedenaście\";\"dwanaście\";\"trzynaście\";\"czternaście\";\"piętnaście\";\"szesnaście\";\"siedemnaście\";\"osiemnaście\";\"dziewiętnaście\"},RIGHT(TEXT(MID(TEXT(INT(G35),\"000000000000\"),4,3)+0,\"00\"),2)+1),INDEX({\"dwadzieścia\";\"trzydzieści\";\"czterdzieści\";\"pięćdziesiąt\";\"sześćdziesiąt\";\"siedemdziesiąt\";\"osiemdziesiąt\";\"dziewięćdziesiąt\"},LEFT(RIGHT(TEXT(MID(TEXT(INT(G35),\"000000000000\"),4,3)+0,\"00\"),2),1)+0-1)&\" \"&INDEX({\"\";\"jeden\";\"dwa\";\"trzy\";\"cztery\";\"pięć\";\"sześć\";\"siedem\";\"osiem\";\"dziewięć\"},RIGHT(TEXT(MID(TEXT(INT(G35),\"000000000000\"),4,3)+0,\"0\"),1)+0+1)),\"\")&\" \"&IF(MID(TEXT(INT(G35),\"000000000000\"),4,3)+0>0,INDEX({\"milionów\";\"milion\";\"miliony\"},(MID(TEXT(INT(G35),\"000000000000\"),4,3)+0=1)+(AND(RIGHT(TEXT(MID(TEXT(INT(G35),\"000000000000\"),4,3)+0,\"0\"),1)+0>=2,RIGHT(TEXT(MID(TEXT(INT(G35),\"000000000000\"),4,3)+0,\"0\"),1)+0<=4,LEFT(RIGHT(TEXT(MID(TEXT(INT(G35),\"000000000000\"),4,3)+0,\"00\"),2),1)+0<>1))*2+1),\"\")&\" \"&IF(MID(TEXT(INT(G35),\"000000000000\"),7,3)+0>1,IF(LEFT(TEXT(MID(TEXT(INT(G35),\"000000000000\"),7,3)+0,\"000\"),1)+0>0,INDEX({\"sto\";\"dwieście\";\"trzysta\";\"czterysta\";\"pięćset\";\"sześćset\";\"siedemset\";\"osiemset\";\"dziewięćset\"},LEFT(TEXT(MID(TEXT(INT(G35),\"000000000000\"),7,3)+0,\"000\"),1)+0)&\" \",\"\")&IF(RIGHT(TEXT(MID(TEXT(INT(G35),\"000000000000\"),7,3)+0,\"00\"),2)+0<20,INDEX({\"\";\"jeden\";\"dwa\";\"trzy\";\"cztery\";\"pięć\";\"sześć\";\"siedem\";\"osiem\";\"dziewięć\";\"dziesięć\";\"jedenaście\";\"dwanaście\";\"trzynaście\";\"czternaście\";\"piętnaście\";\"szesnaście\";\"siedemnaście\";\"osiemnaście\";\"dziewiętnaście\"},RIGHT(TEXT(MID(TEXT(INT(G35),\"000000000000\"),7,3)+0,\"00\"),2)+1),INDEX({\"dwadzieścia\";\"trzydzieści\";\"czterdzieści\";\"pięćdziesiąt\";\"sześćdziesiąt\";\"siedemdziesiąt\";\"osiemdziesiąt\";\"dziewięćdziesiąt\"},LEFT(RIGHT(TEXT(MID(TEXT(INT(G35),\"000000000000\"),7,3)+0,\"00\"),2),1)+0-1)&\" \"&INDEX({\"\";\"jeden\";\"dwa\";\"trzy\";\"cztery\";\"pięć\";\"sześć\";\"siedem\";\"osiem\";\"dziewięć\"},RIGHT(TEXT(MID(TEXT(INT(G35),\"000000000000\"),7,3)+0,\"0\"),1)+0+1)),\"\")&\" \"&IF(MID(TEXT(INT(G35),\"000000000000\"),7,3)+0>0,INDEX({\"tysięcy\";\"tysiąc\";\"tysiące\"},(MID(TEXT(INT(G35),\"000000000000\"),7,3)+0=1)+(AND(RIGHT(TEXT(MID(TEXT(INT(G35),\"000000000000\"),7,3)+0,\"0\"),1)+0>=2,RIGHT(TEXT(MID(TEXT(INT(G35),\"000000000000\"),7,3)+0,\"0\"),1)+0<=4,LEFT(RIGHT(TEXT(MID(TEXT(INT(G35),\"000000000000\"),7,3)+0,\"00\"),2),1)+0<>1))*2+1),\"\")&\" \"&IF(LEFT(TEXT(MID(TEXT(INT(G35),\"000000000000\"),10,3)+0,\"000\"),1)+0>0,INDEX({\"sto\";\"dwieście\";\"trzysta\";\"czterysta\";\"pięćset\";\"sześćset\";\"siedemset\";\"osiemset\";\"dziewięćset\"},LEFT(TEXT(MID(TEXT(INT(G35),\"000000000000\"),10,3)+0,\"000\"),1)+0)&\" \",\"\")&IF(RIGHT(TEXT(MID(TEXT(INT(G35),\"000000000000\"),10,3)+0,\"00\"),2)+0<20,INDEX({\"\";\"jeden\";\"dwa\";\"trzy\";\"cztery\";\"pięć\";\"sześć\";\"siedem\";\"osiem\";\"dziewięć\";\"dziesięć\";\"jedenaście\";\"dwanaście\";\"trzynaście\";\"czternaście\";\"piętnaście\";\"szesnaście\";\"siedemnaście\";\"osiemnaście\";\"dziewiętnaście\"},RIGHT(TEXT(MID(TEXT(INT(G35),\"000000000000\"),10,3)+0,\"00\"),2)+1),INDEX({\"dwadzieścia\";\"trzydzieści\";\"czterdzieści\";\"pięćdziesiąt\";\"sześćdziesiąt\";\"siedemdziesiąt\";\"osiemdziesiąt\";\"dziewięćdziesiąt\"},LEFT(RIGHT(TEXT(MID(TEXT(INT(G35),\"000000000000\"),10,3)+0,\"00\"),2),1)+0-1)&\" \"&INDEX({\"\";\"jeden\";\"dwa\";\"trzy\";\"cztery\";\"pięć\";\"sześć\";\"siedem\";\"osiem\";\"dziewięć\"},RIGHT(TEXT(MID(TEXT(INT(G35),\"000000000000\"),10,3)+0,\"0\"),1)+0+1)))&\" \"&INDEX({\"złotych\";\"złoty\";\"złote\"},(INT(G35)=1)+(AND(RIGHT(TEXT(INT(G35),\"0\"),1)+0>=2,RIGHT(TEXT(INT(G35),\"0\"),1)+0<=4,LEFT(RIGHT(TEXT(INT(G35),\"00\"),2),1)+0<>1))*2+1)&\" \"&IF(RIGHT(TEXT(INT(G35*100)/100,\"0,00\"),2)+0=0,\"zero\",IF(RIGHT(TEXT(RIGHT(TEXT(INT(G35*100)/100,\"0,00\"),2)+0,\"00\"),2)+0<20,INDEX({\"\";\"jeden\";\"dwa\";\"trzy\";\"cztery\";\"pięć\";\"sześć\";\"siedem\";\"osiem\";\"dziewięć\";\"dziesięć\";\"jedenaście\";\"dwanaście\";\"trzynaście\";\"czternaście\";\"piętnaście\";\"szesnaście\";\"siedemnaście\";\"osiemnaście\";\"dziewiętnaście\"},RIGHT(TEXT(RIGHT(TEXT(INT(G35*100)/100,\"0,00\"),2)+0,\"00\"),2)+1),INDEX({\"dwadzieścia\";\"trzydzieści\";\"czterdzieści\";\"pięćdziesiąt\";\"sześćdziesiąt\";\"siedemdziesiąt\";\"osiemdziesiąt\";\"dziewięćdziesiąt\"},LEFT(RIGHT(TEXT(RIGHT(TEXT(INT(G35*100)/100,\"0,00\"),2)+0,\"00\"),2),1)+0-1)&\" \"&INDEX({\"\";\"jeden\";\"dwa\";\"trzy\";\"cztery\";\"pięć\";\"sześć\";\"siedem\";\"osiem\";\"dziewięć\"},RIGHT(TEXT(RIGHT(TEXT(INT(G35*100)/100,\"0,00\"),2)+0,\"0\"),1)+0+1)))&\" \"&INDEX({\"groszy\";\"grosz\";\"grosze\"},(RIGHT(TEXT(INT(G35*100)/100,\"0,00\"),2)+0=1)+(AND(RIGHT(TEXT(RIGHT(TEXT(INT(G35*100)/100,\"0,00\"),2)+0,\"0\"),1)+0>=2,RIGHT(TEXT(RIGHT(TEXT(INT(G35*100)/100,\"0,00\"),2)+0,\"0\"),1)+0<=4,LEFT(RIGHT(TEXT(RIGHT(TEXT(INT(G35*100)/100,\"0,00\"),2)+0,\"00\"),2),1)+0<>1))*2+1))","v":"pięćset osiem złotych zero groszy"},null,null,null,"X",{"$f":"SUM(G20:G31)+SUM(G14:G18)+SUM(G6:G12)","v":508}]
[]
["Zwrócone rejestry (szt.)",null,null,"Zwolnieni ze zwrotów rejestrów (szt.)"]
[]
["………………………..",null,null,"…………………………………."]
["                 ………………………………………………                                                                                  ……………………………………………"]
["                              OTRZYMAŁ                                                                                                                                       WYSTAWIŁ"]